*INCLUDE, INPUT=Solid/all.msh
*INCLUDE, INPUT=Solid/fix1_beam.nam
*INCLUDE, INPUT=Solid/interface_beam.nam
*MATERIAL, Name=EL
*ELASTIC
 400000, 0.3
*DENSITY
 3000
*SPECIFIC HEAT
446
*CONDUCTIVITY
50.,0
*SOLID SECTION, Elset=Eall, Material=EL
*INITIAL CONDITIONs, TYPE=TEMPERATURE
Nall, 400.
*STEP, NLGEOM, INC=1000000
*HEAT TRANSFER, DIRECT, STEADY STATE
1.E-2, 10.0
*BOUNDARY
Nsurface, 11, 11, 400.
*DFLUX
*INCLUDE, INPUT=Solid/all.dfl
*FILM
*INCLUDE, INPUT=Solid/all.flm
*NODE FILE
NT
*END STEP