**
** Heading +++++++++++++++++++++++++++++++++++++++++++++++++
**
*Heading
Hash: n1vU0AJW, Date: 04/27/2023, Unit system: M_KG_S_C
**
** Nodes +++++++++++++++++++++++++++++++++++++++++++++++++++
**
*Node
**
** Elements ++++++++++++++++++++++++++++++++++++++++++++++++
**
*Element, Type=C3D10, Elset=Solid_part-1
**
** Node sets +++++++++++++++++++++++++++++++++++++++++++++++
**
*Nset, Nset=inlet
*Nset, Nset=outlet
*Nset, Nset=interface
*Nset, Nset=wall
*Nset, Nset=Internal-1_Sinterface
*Nset, Nset=Internal-1_Swall
**
** Element sets ++++++++++++++++++++++++++++++++++++++++++++
**
*Elset, Elset=Eouter
*Elset, Elset=Eall
*Elset, Elset=Internal-1_Sinterface_S3
*Elset, Elset=Internal-1_Sinterface_S2
*Elset, Elset=Internal-1_Sinterface_S1
*Elset, Elset=Internal-1_Sinterface_S4
*Elset, Elset=Internal-1_Swall_S4
*Elset, Elset=Internal-1_Swall_S3
*Elset, Elset=Internal-1_Swall_S1
*Elset, Elset=Internal-1_Swall_S2
**
** Surfaces ++++++++++++++++++++++++++++++++++++++++++++++++
**
*Surface, Name=Sinterface, Type=Element
Internal-1_Sinterface_S3, S3
Internal-1_Sinterface_S2, S2
Internal-1_Sinterface_S1, S1
Internal-1_Sinterface_S4, S4
*Surface, Name=Swall, Type=Element
Internal-1_Swall_S4, S4
Internal-1_Swall_S3, S3
Internal-1_Swall_S1, S1
Internal-1_Swall_S2, S2
**
** Physical constants ++++++++++++++++++++++++++++++++++++++
**
**
** Materials +++++++++++++++++++++++++++++++++++++++++++++++
**
*Material, Name=PDMS
*Density
1200
*Elastic
300000, 0.3
**
** Sections ++++++++++++++++++++++++++++++++++++++++++++++++
**
*Solid section, Elset=Solid_part-1, Material=PDMS
**
** Pre-tension sections ++++++++++++++++++++++++++++++++++++
**
**
** Constraints +++++++++++++++++++++++++++++++++++++++++++++
**
**
** Surface interactions ++++++++++++++++++++++++++++++++++++
**
**
** Contact pairs +++++++++++++++++++++++++++++++++++++++++++
**
**
** Amplitudes ++++++++++++++++++++++++++++++++++++++++++++++
**
**
** Initial conditions ++++++++++++++++++++++++++++++++++++++
**
**
** Steps +++++++++++++++++++++++++++++++++++++++++++++++++++
**
**
** Step-1 ++++++++++++++++++++++++++++++++++++++++++++++++++
**
*Step
*Static
**
** Boundary conditions +++++++++++++++++++++++++++++++++++++
**
*Boundary, op=New
** Name: Fixed-1
*Boundary
inlet, 1, 6, 0
** Name: Fixed-2
*Boundary
outlet, 1, 6, 0
**
** Loads +++++++++++++++++++++++++++++++++++++++++++++++++++
**
*Cload, op=New
*Dload, op=New
** Name: Uniform_pressure-1
*Dload
Internal-1_Swall_S4, P4, 4292.9803
Internal-1_Swall_S3, P3, 4292.9803
Internal-1_Swall_S1, P1, 4292.9803
Internal-1_Swall_S2, P2, 4292.9803
**
** Defined fields ++++++++++++++++++++++++++++++++++++++++++
**
**
** History outputs +++++++++++++++++++++++++++++++++++++++++
**
**
** Field outputs +++++++++++++++++++++++++++++++++++++++++++
**
*Node file
RF, U
*El file
S, E
**
** End step ++++++++++++++++++++++++++++++++++++++++++++++++
**
*End step